FATE

   
TimeRevArchOSCompilerCommentWarningsTests
4 days agoN-62573-gcd4faedx86_32os/2gcc 4.4.6 (GCC)nasm 2.11 732 ±1954 / 1954
2 days agoN-62670-g31f2357ppclinuxgcc 4.5.1 (Ubuntu/Linaro 4.5.1-7ubuntu2)(TB) 666 ±1954 / 1954
44 hours agoN-62677-gd66de50ppclinuxgcc 4.3.5 (Ubuntu 4.3.5-3ubuntu1)(TB) 587 ±1955 / 1955
43 hours agoN-62677-gd66de50ppclinuxgcc 4.4.5 (Ubuntu/Linaro 4.4.4-14ubuntu5)(TB) 661 ±1955 / 1955
32 hours agoN-62653-g1aa388dx86_32cygwingcc 4.8.2 (GCC) 106 ±1955 / 1955
23 hours agoN-62647-gdc6a17carmv5linuxgcc 4.6 (Ubuntu/Linaro 4.6.3-1ubuntu5) 269 ±1954 / 1954
22 hours agoN-62647-gdc6a17carmv6t2linuxgcc 4.6 (Ubuntu/Linaro 4.6.3-1ubuntu5) 215 ±1954 / 1954
21 hours agoN-62669-g443936darmv7adarwinApple LLVM version 5.1 (clang-503.0.38) (based on LLVM 3.4svn) 189 ±build only
21 hours agoN-62669-g443936daarch64darwinApple LLVM version 5.1 (clang-503.0.38) (based on LLVM 3.4svn) 286 ±build only
21 hours agoN-62669-g443936dx86_64darwinApple LLVM version 5.1 (clang-503.0.38) (based on LLVM 3.4svn) 314 ±1955 / 1955
20 hours agoN-62647-gdc6a17carmv7linuxgcc 4.6 (Ubuntu/Linaro 4.6.3-1ubuntu5) 215 ±1954 / 1954
20 hours agoN-62670-g31f2357x86_32darwinclang version 3.3 (tags/RELEASE_33/final) 142 ±1952 / 1952
19 hours agoN-62670-g31f2357x86_32darwinclang version 3.4 (tags/RELEASE_34/final) 171 ±1952 / 1952
19 hours agoN-62647-gdc6a17carmv7alinuxgcc 4.6 (Ubuntu/Linaro 4.6.3-1ubuntu5) 215 ±1953 / 1954
1 failed testStatus
vsynth2-flashsv21
19 hours agoN-62670-g31f2357x86_32darwinclang version 3.5.0 (trunk 206638) 182 ±1952 / 1952
19 hours agoN-62670-g31f2357x86_64openbsdgcc 3.3.6 (GCC) 1222 ±1954 / 1954
18 hours agoN-62670-g31f2357x86_32darwinclang version 3.5.0 (trunk 206638)-O3 182 ±1952 / 1952
18 hours agoN-62647-gdc6a17carmv7alinuxgcc 4.6 (Ubuntu/Linaro 4.6.3-1ubuntu5)--enable-neon-clobber-test 215 ±1954 / 1954
18 hours agoN-62670-g31f2357x86_32darwinApple LLVM version 5.1 (clang-503.0.38) (based on LLVM 3.4svn) 171 ±1952 / 1952
17 hours agoN-62670-g31f2357x86_64netbsdgcc 4.1.3 (GCC) 20080704 peelease (NetBSD nb2 20081120) 1307 ±1955 / 1955
17 hours agoN-62670-g31f2357x86_64linuxgcc 4.5.1 (Ubuntu/Linaro 4.5.1-7ubuntu2)(TB) 633 ±1955 / 1955
17 hours agoN-62670-g31f2357x86_64openbsdgcc 4.2.1 (GCC) 20070719 2546 ±1951 / 1951
17 hours agoN-62670-g31f2357x86_64linuxicc (ICC) 12.0.4 20110427(TB) 306 ±1955 / 1955
17 hours agoN-62670-g31f2357x86_32darwinclang version 3.5.0 (trunk 206638)-polly 182 ±1942 / 1952
10 failed testsStatus
acodec-g723_11
amrnb-10k21
amrnb-4k751
amrnb-5k151
amrnb-5k91
amrnb-6k71
amrnb-7k41
amrnb-7k951
filter-metadata-ebur1281
sipr-16k1
17 hours agoN-62670-g31f2357x86_64freebsdgcc 3.4.6 (GCC) [FeeBSD]--disable-asm 1282 ±1951 / 1951
17 hours agoN-62647-gdc6a17carmv7alinuxgcc 4.6 (Ubuntu/Linaro 4.6.3-1ubuntu5)--enable-pic 215 ±1954 / 1954
17 hours agoN-62670-g31f2357x86_64netbsdgcc 3.3.6 (GCC) 1294 ±1955 / 1955
16 hours agoN-62670-g31f2357x86_32gnu/kfreebsdgcc 4.4.5 (Debian 4.4.5-8) 629 ±1955 / 1955
16 hours agoN-62670-g31f2357x86_32darwinclang version 3.5.0 (trunk 206638)-polly -polly-vectorizer=polly 182 ±1941 / 1952
11 failed testsStatus
acodec-g723_11
amrnb-10k21
amrnb-4k751
amrnb-5k151
amrnb-5k91
amrnb-6k71
amrnb-7k41
amrnb-7k951
filter-metadata-ebur1281
filter-separatefields1
sipr-16k1
16 hours agoN-62670-g31f2357x86_64openbsdgcc 4.2.1 (GCC) 20070719hardcoded tables without asm 2552 ±1951 / 1951
16 hours agoN-62670-g31f2357x86_32gnu/kfreebsdgcc 4.4.5 (Debian 4.4.5-8)cpuflags=0 629 ±1955 / 1955
16 hours agoN-62670-g31f2357x86_64freebsdgcc 4.2.5 (GCC) 20090325 (peelease)--disable-asm 629 ±1951 / 1951
16 hours agoN-62647-gdc6a17carmv7alinuxgcc 4.6 (Ubuntu/Linaro 4.6.3-1ubuntu5)2 threads 215 ±1952 / 1954
2 failed testsStatus
vp9-00-quantizer-011
vp9-00-quantizer-021
16 hours agoN-62670-g31f2357x86_32linuxgcc 4.5.1 (Ubuntu/Linaro 4.5.1-7ubuntu2)(TB) 666 ±1955 / 1955
16 hours agoN-62670-g31f2357x86_64netbsdgcc 3.4.6 (GCC) 1280 ±1955 / 1955
16 hours agoN-62670-g31f2357x86_32gnu/kfreebsdgcc 4.4.5 (Debian 4.4.5-8)cpuflags=MMX 629 ±1955 / 1955
16 hours agoN-62669-g443936dmipslinuxgcc 4.4.5 (Debian 4.4.4-8) 20100728 (prerelease)MIPS Malta 74Kf board 634 ±1953 / 1953
16 hours agoN-62670-g31f2357x86_32darwingcc 4.6.4 (MacPots gcc46 4.6.4_3+univesal)--disable-yasm 222 ±1955 / 1955
15 hours agoN-62670-g31f2357x86_32gnu/kfreebsdgcc 4.4.5 (Debian 4.4.5-8)cpuflags=MMX + MMX2 629 ±1955 / 1955
15 hours agoN-62670-g31f2357x86_64freebsdgcc 4.4.6 (GCC) 20110201 (peelease) 616 ±1955 / 1955
15 hours agoN-62670-g31f2357x86_64netbsdgcc 4.4.7 (GCC) 629 ±1955 / 1955
15 hours agoN-62670-g31f2357x86_32gnu/kfreebsdgcc 4.4.5 (Debian 4.4.5-8)cpuflags=MMX + MMX2 + SSE 629 ±1955 / 1955
15 hours agoN-62647-gdc6a17carmv7alinuxgcc 4.6 (Ubuntu/Linaro 4.6.3-1ubuntu5)--enable-thumb 215 ±1954 / 1954
15 hours agoN-62670-g31f2357x86_64openbsdgcc 4.2.1 (GCC) 20070719--enable-ftrapv 2546 ±1951 / 1951
15 hours agoN-62670-g31f2357x86_32linuxicc (ICC) 12.0.4 20110427(TB) --disable-decoder=hevc 339 ±1820 / 1820
15 hours agoN-62670-g31f2357x86_32win32Intel(R) C++ Compiler XE for applications running on IA-32, Version 14.0.2.176 Build 20140130ICL 2013 Shared (32-bit) 2295 ±1922 / 1922
15 hours agoN-62670-g31f2357x86_32gnu/kfreebsdgcc 4.4.5 (Debian 4.4.5-8)cpuflags=MMX + MMX2 + SSE + SSE2 629 ±1955 / 1955
15 hours agoN-62670-g31f2357x86_32darwingcc 4.7.3 (MacPots gcc47 4.7.3_3+univesal) 163 ±1955 / 1955
15 hours agoN-62670-g31f2357x86_64netbsdgcc 4.5.3 (GCC) 594 ±1955 / 1955
15 hours agoN-62670-g31f2357x86_32gnu/kfreebsdgcc 4.4.5 (Debian 4.4.5-8)cpuflags=MMX + MMX2 + SSE + SSE2 + SSE3 629 ±1955 / 1955
15 hours agoN-62670-g31f2357x86_64freebsdgcc 4.6.0 (GCC) 20110205 (expeimental) 207 ±1955 / 1955
15 hours agoN-62670-g31f2357x86_64win64Intel(R) C++ Intel(R) 64 Compiler XE for applications running on Intel(R) 64, Version 14.0.2.176 Build 20140130ICL 2013 Shared 2309 ±1951 / 1951
14 hours agoN-62670-g31f2357x86_64netbsdgcc 4.6.3 (GCC) 204 ±1955 / 1955
14 hours agoN-62670-g31f2357x86_32gnu/kfreebsdgcc 4.4.5 (Debian 4.4.5-8)cpuflags=MMX + MMX2 + SSE + SSE2 + SSE3 + SSSE3 + SSE4.1 629 ±1955 / 1955
14 hours agoN-62670-g31f2357x86_64linuxgcc 4.4.5 (Ubuntu/Linaro 4.4.4-14ubuntu5)(TB) 634 ±1955 / 1955
14 hours agoN-62670-g31f2357x86_32darwingcc 4.8.2 (MacPots gcc48 4.8.2_0+univesal) 160 ±1955 / 1955
14 hours agoN-62670-g31f2357x86_32gnu/kfreebsdgcc 4.4.5 (Debian 4.4.5-8)cpuflags=MMX + MMX2 + SSE + SSE2 + SSE3 + SSSE3 + SSE4.1 + SSE4.2 629 ±1955 / 1955
14 hours agoN-62670-g31f2357x86_32gnu/kfreebsdgcc 4.4.5 (Debian 4.4.5-8)cpuflags=MMX + MMX2 + SSE + SSE2 + SSE3 + SSSE3 629 ±1955 / 1955
14 hours agoN-62670-g31f2357armv4tlinuxgcc 4.4.7 (Ubuntu/Linaro 4.4.7-1ubuntu2) 1917 ±1954 / 1954
13 hours agoN-62670-g31f2357x86_64linuxgcc 4.4.5 (Ubuntu/Linaro 4.4.4-14ubuntu5)(TB) --enable-small 575 ±1955 / 1955
13 hours agoN-62670-g31f2357x86_32darwingcc 4.9.0 (MacPots gcc49 4.9-20140416_0+univesal) 20140416 (peelease) 160 ±1941 / 1954
13 failed testsStatus
acodec-flac1
filter-metadata-ebur1281
flac-16-chmode-indep1
flac-16-chmode-left_side1
flac-16-chmode-mid_side1
flac-16-chmode-right_side1
flac-16-fixed1
flac-16-lpc-cholesky1
flac-16-lpc-levinson1
flac-24-comp-81
loco-rgb1
loco-yuy21
lossless-shorten1
13 hours agoN-62670-g31f2357x86_64freebsdgcc 4.6.0 (GCC) 20110205 (expeimental)--disable-optimizations 140 ±1955 / 1955
13 hours agoN-62670-g31f2357x86_64darwinclang version 3.3 (tags/RELEASE_33/final) 143 ±1952 / 1952
12 hours agoN-62670-g31f2357x86_64freebsdllvm-gcc 4.2.1 (LLVM build) 529 ±1952 / 1952
12 hours agoN-62670-g31f2357x86_32linuxgcc 4.5.1 (Ubuntu/Linaro 4.5.1-7ubuntu2)(TB) !HAVE_6REGS 130 ±error compiling
/home/fate/x86_32-linux-gnu-gcc-4.5.1-have_6regs/src/libavfilter/internal.h: In function ‘ff_insert_inpad’:
/home/fate/x86_32-linux-gnu-gcc-4.5.1-have_6regs/src/libavfilter/internal.h:275:5: warning: ‘input_count’ is deprecated (declared at /home/fate/x86_32-linux-gnu-gcc-4.5.1-have_6regs/src/libavfilter/avfilter.h:643)
/home/fate/x86_32-linux-gnu-gcc-4.5.1-have_6regs/src/libavfilter/internal.h: In function ‘ff_insert_outpad’:
/home/fate/x86_32-linux-gnu-gcc-4.5.1-have_6regs/src/libavfilter/internal.h:289:5: warning: ‘output_count’ is deprecated (declared at /home/fate/x86_32-linux-gnu-gcc-4.5.1-have_6regs/src/libavfilter/avfilter.h:650)
CC	libavfilter/framesync.o
In file included from /home/fate/x86_32-linux-gnu-gcc-4.5.1-have_6regs/src/libavfilter/framesync.c:25:0:
/home/fate/x86_32-linux-gnu-gcc-4.5.1-have_6regs/src/libavfilter/internal.h: In function ‘ff_insert_inpad’:
/home/fate/x86_32-linux-gnu-gcc-4.5.1-have_6regs/src/libavfilter/internal.h:275:5: warning: ‘input_count’ is deprecated (declared at /home/fate/x86_32-linux-gnu-gcc-4.5.1-have_6regs/src/libavfilter/avfilter.h:643)
/home/fate/x86_32-linux-gnu-gcc-4.5.1-have_6regs/src/libavfilter/internal.h: In function ‘ff_insert_outpad’:
/home/fate/x86_32-linux-gnu-gcc-4.5.1-have_6regs/src/libavfilter/internal.h:289:5: warning: ‘output_count’ is deprecated (declared at /home/fate/x86_32-linux-gnu-gcc-4.5.1-have_6regs/src/libavfilter/avfilter.h:650)
CC	libavfilter/graphdump.o
CC	libavfilter/graphparser.o
CC	libavfilter/lavfutils.o
CC	libavfilter/libmpcodecs/img_format.o
CC	libavfilter/libmpcodecs/mp_image.o
CC	libavfilter/libmpcodecs/vf_eq.o
/home/fate/x86_32-linux-gnu-gcc-4.5.1-have_6regs/src/libavfilter/libmpcodecs/vf_eq.c: In function ‘process_MMX’:
/home/fate/x86_32-linux-gnu-gcc-4.5.1-have_6regs/src/libavfilter/libmpcodecs/vf_eq.c:58:17: error: can't find a register in class ‘GENERAL_REGS’ while reloading ‘asm’
/home/fate/x86_32-linux-gnu-gcc-4.5.1-have_6regs/src/libavfilter/libmpcodecs/vf_eq.c:58:17: error: ‘asm’ operand has impossible constraints
make: *** [libavfilter/libmpcodecs/vf_eq.o] Error 1
12 hours agoN-62670-g31f2357x86_64darwinclang version 3.4 (tags/RELEASE_34/final) 172 ±1952 / 1952
12 hours agoN-62670-g31f2357x86_64linuxgcc 4.8.2 (GCC) 20140206 (prerelease)Helgrind (threads=2) 126 ±1138 / 1904
12 hours agoN-62670-g31f2357armv5tlinuxgcc 4.4.7 (Ubuntu/Linaro 4.4.7-1ubuntu2) 1922 ±1954 / 1954
12 hours agoN-62670-g31f2357x86_64cygwingcc 4.8.2 (GCC) 231 ±1952 / 1952
12 hours agoN-62670-g31f2357x86_64darwinclang version 3.5.0 (trunk 206638) 181 ±1952 / 1952
12 hours agoN-62670-g31f2357x86_64linuxgcc 4.8.2 (GCC) 20140206 (prerelease)checkheaders 147 ±build only
11 hours agoN-62670-g31f2357x86_64linuxgcc 4.8.2 (GCC) 20140206 (prerelease)-DDEBUG -DTRACE 131 ±1955 / 1955
11 hours agoN-62670-g31f2357x86_64linuxgcc 4.8.2 (GCC) 20140206 (prerelease)--disable-avcodec 25 ±22 / 22
11 hours agoN-62670-g31f2357x86_64darwinclang version 3.5.0 (trunk 206638)-O3 181 ±1952 / 1952
11 hours agoN-62670-g31f2357armv5tlinuxgcc 4.1.3 (GCC) 20080704 (prerelease) (Ubuntu 4.1.2-27ubuntu1) 1333 ±1954 / 1954
11 hours agoN-62670-g31f2357x86_64linuxgcc 4.8.2 (GCC) 20140206 (prerelease)--disable-avdevice 126 ±1941 / 1941
11 hours agoN-62670-g31f2357x86_64linuxgcc 4.8.2 (GCC) 20140206 (prerelease)--disable-avfilter 115 ±178 / 178
11 hours agoN-62670-g31f2357x86_64linuxgcc 4.8.2 (GCC) 20140206 (prerelease)--disable-avformat 116 ±170 / 170
11 hours agoN-62670-g31f2357aarch64darwinApple LLVM version 5.1 (clang-503.0.38) (based on LLVM 3.4svn)--disable-asm 166 ±build only
11 hours agoN-62670-g31f2357x86_64linuxgcc 4.8.2 (GCC) 20140206 (prerelease)--disable-everything 72 ±27 / 27
11 hours agoN-62670-g31f2357x86_64linuxgcc 4.8.2 (GCC) 20140206 (prerelease)--disable-mmx 147 ±build only
11 hours agoN-62670-g31f2357x86_64linuxgcc 4.8.2 (GCC) 20140206 (prerelease)--disable-optimizations 119 ±build only
11 hours agoN-62670-g31f2357x86_64linuxgcc 4.8.2 (GCC) 20140206 (prerelease)--disable-swresample 126 ±178 / 178
11 hours agoN-62670-g31f2357armv7adarwinApple LLVM version 5.1 (clang-503.0.38) (based on LLVM 3.4svn)--disable-asm 169 ±build only
11 hours agoN-62670-g31f2357x86_64linuxgcc 4.8.2 (GCC) 20140206 (prerelease)--disable-swscale 126 ±1400 / 1837
11 hours agoN-62670-g31f2357armv6jdarwinApple LLVM version 5.1 (clang-503.0.38) (based on LLVM 3.4svn)--disable-asm 1394 ±build only
11 hours agoN-62670-g31f2357x86_64darwinApple LLVM version 5.1 (clang-503.0.38) (based on LLVM 3.4svn) 172 ±1952 / 1952
11 hours agoN-62670-g31f2357x86_64linuxgcc 4.8.2 (GCC) 20140206 (prerelease)--disable-zlib 129 ±1926 / 1926
10 hours agoN-62670-g31f2357armv5telinuxgcc 4.4.7 (Ubuntu/Linaro 4.4.7-1ubuntu2) 1920 ±1954 / 1954
10 hours agoN-62670-g31f2357x86_64linuxgcc 4.8.2 (GCC) 20140206 (prerelease)--enable-shared + libs 129 ±1955 / 1955
10 hours agoN-62670-g31f2357x86_64linuxgcc 4.8.2 (GCC) 20140206 (prerelease)Examples 128 ±build only
10 hours agoN-62670-g31f2357x86_64linuxicc (ICC) 13.1.1 20130313 267 ±1955 / 1955
10 hours agoN-62670-g31f2357x86_64darwinclang version 3.5.0 (trunk 206638)-polly 181 ±1951 / 1952
1 failed testStatus
acodec-g723_11
10 hours agoN-62670-g31f2357x86_64darwinclang version 3.5.0 (trunk 206638)-polly -polly-vectorizer=polly 181 ±1950 / 1952
2 failed testsStatus
acodec-g723_11
filter-separatefields1
10 hours agoN-62670-g31f2357x86_64linuxgcc 4.8.2 (GCC) 20140206 (prerelease)LTO (+ no inline asm) 135 ±1954 / 1954
10 hours agoN-62670-g31f2357x86_64linuxgcc 4.8.2 (GCC) 20140206 (prerelease)NASM version 2.11.01 194 ±1955 / 1955
10 hours agoN-62670-g31f2357x86_64linuxgcc 4.8.2 (GCC) 20140206 (prerelease)--disable-gpl 124 ±1925 / 1925
9 hours agoN-62670-g31f2357x86_64linuxgcc 4.8.2 (GCC) 20140206 (prerelease)yasm-0.8.0 126 ±1955 / 1955
9 hours agoN-62670-g31f2357x86_64linuxgcc 4.8.2 (GCC) 20140206 (prerelease)--enable-random 107 ±build only
9 hours agoN-62670-g31f2357x86_64linuxgcc 4.8.2 (GCC) 20140206 (prerelease)disable runtime cpu detect 126 ±1955 / 1955
9 hours agoN-62670-g31f2357x86_64darwingcc 4.6.4 (MacPots gcc46 4.6.4_3+univesal)--disable-yasm 217 ±1955 / 1955
9 hours agoN-62670-g31f2357x86_64darwingcc 4.7.3 (MacPots gcc47 4.7.3_3+univesal) 158 ±1955 / 1955
9 hours agoN-62670-g31f2357armv6linuxgcc 4.4.7 (Ubuntu/Linaro 4.4.7-1ubuntu2) 1903 ±1954 / 1954
9 hours agoN-62670-g31f2357x86_64linuxgcc 4.8.2 (GCC) 20140206 (prerelease)16 threads 126 ±1953 / 1955
2 failed testsStatus
vp9-00-quantizer-011
vp9-00-quantizer-021
9 hours agoN-62670-g31f2357armv7alinuxgcc 4.4.3 (Ubuntu 4.4.3-4ubuntu5.1) 1924 ±1954 / 1954
9 hours agoN-62670-g31f2357x86_64linuxgcc 4.8.2 (GCC) 20140206 (prerelease)2 threads 126 ±1953 / 1955
2 failed testsStatus
vp9-00-quantizer-011
vp9-00-quantizer-021
9 hours agoN-62663-gfc145e5mipslinuxgcc 4.4.5 (Debian 4.4.5-8)--disable-mipsfpu --disable-pthreads 855 ±1951 / 1951
9 hours agoN-62670-g31f2357x86_64linuxgcc 4.8.2 (GCC) 20140206 (prerelease)8 threads 126 ±1953 / 1955
2 failed testsStatus
vp9-00-quantizer-011
vp9-00-quantizer-021
9 hours agoN-62670-g31f2357x86_64linuxgcc 4.8.2 (GCC) 20140206 (prerelease)threads auto 126 ±1953 / 1955
2 failed testsStatus
vp9-00-quantizer-011
vp9-00-quantizer-021
9 hours agoN-62670-g31f2357x86_64linuxgcc 4.8.2 (GCC) 20140206 (prerelease)THREADS=7 THREAD_TYPE=slice 126 ±1955 / 1955
9 hours agoN-62670-g31f2357x86_64darwingcc 4.8.2 (MacPots gcc48 4.8.2_0+univesal) 155 ±1955 / 1955
8 hours agoN-62670-g31f2357x86_64darwingcc 4.9.0 (MacPots gcc49 4.9-20140416_0+univesal) 20140416 (peelease) 155 ±1941 / 1954
13 failed testsStatus
acodec-flac1
filter-metadata-ebur1281
flac-16-chmode-indep1
flac-16-chmode-left_side1
flac-16-chmode-mid_side1
flac-16-chmode-right_side1
flac-16-fixed1
flac-16-lpc-cholesky1
flac-16-lpc-levinson1
flac-24-comp-81
loco-rgb1
loco-yuy21
lossless-shorten1
8 hours agoN-62653-g1aa388dx86_64mingw32gcc 4.6 (GCC) 466 ±1952 / 1952
8 hours agoN-62653-g1aa388dx86_64mingw32gcc 4.6 (GCC)--enable-shared 466 ±build only
8 hours agoN-62670-g31f2357armv6jlinuxgcc 4.4.7 (Ubuntu/Linaro 4.4.7-1ubuntu2) 1920 ±1954 / 1954
8 hours agoN-62653-g1aa388dx86_64mingw32gcc 4.6 (GCC)--enable-xmm-clobber-test 466 ±1952 / 1952
7 hours agoN-62653-g1aa388dx86_64linuxOpen64 Compiler Suite Version 5.0 10811 ±1954 / 1954
7 hours agoN-62670-g31f2357alphalinuxgcc 4.7 (Debian 4.7.1-3)--enable-shared 369 ±build only
7 hours agoN-62670-g31f2357armv7alinuxgcc 4.4.3 (Ubuntu 4.4.3-4ubuntu5.1) 1924 ±1954 / 1954
7 hours agoN-62670-g31f2357armv7alinuxgcc 4.4.3 (GCC)Android NDKr8 775 ±build only
7 hours agoN-62670-g31f2357armv7alinuxgcc 4.4.3 (GCC)Android NDKr8 --enable-shared 775 ±build only
7 hours agoN-62663-gfc145e5sh4linuxgcc 4.7 (Debian 4.7.1-3) 388 ±1951 / 1951
7 hours agoN-62670-g31f2357parisclinuxgcc 4.2.4 (GCC) (Debian 4.2.4-6) 866 ±build only
7 hours agoN-62670-g31f2357armv6zlinuxgcc 4.4.7 (Ubuntu/Linaro 4.4.7-1ubuntu2) 1918 ±1954 / 1954
7 hours agoN-62670-g31f2357parisclinuxgcc 4.2.4 (GCC) (Debian 4.2.4-6)--enable-shared 888 ±build only
6 hours agoN-62670-g31f2357ia64linuxgcc 4.4.5 (Debian 4.4.5-8) 844 ±build only
6 hours agoN-62670-g31f2357ia64linuxgcc 4.4.5 (Debian 4.4.5-8)--enable-shared --enable-small 792 ±build only
6 hours agoN-62670-g31f2357mipslinuxgcc 4.4.3 (GCC)Android NDKr8 771 ±build only
6 hours agoN-62670-g31f2357mipslinuxgcc 4.4.3 (GCC)Android NDKr8 --enable-shared 771 ±build only
6 hours agoN-62670-g31f2357x86_64linuxgcc 4.8.2 (GCC) 20140206 (prerelease)Valgrind DRD (threads=2) 126 ±1186 / 1912
6 hours agoN-62670-g31f2357ppclinuxgcc 4.3.5 (Debian 4.3.5-4) 787 ±build only
5 hours agoN-62670-g31f2357s390linuxgcc 4.4.5 (Debian 4.4.5-8) 835 ±build only
5 hours agoN-62678-g5ac10d4x86_32gnu/kfreebsdgcc 4.1.3 (GCC) 20080704 (prerelease) (Debian 4.1.2-29) 1328 ±1956 / 1956
5 hours agoN-62670-g31f2357armv6zklinuxgcc 4.4.7 (Ubuntu/Linaro 4.4.7-1ubuntu2) 1921 ±1954 / 1954
5 hours agoN-62670-g31f2357s390linuxgcc 4.4.5 (Debian 4.4.5-8)--enable-shared 832 ±build only
5 hours agoN-62670-g31f2357alphalinuxgcc 4.7 (Debian 4.7.1-3) 397 ±1951 / 1951
5 hours agoN-62670-g31f2357sh4linuxgcc 4.7 (Debian 4.7.1-3)--enable-shared 360 ±build only
5 hours agoN-62670-g31f2357armv7alinuxgcc 4.4.3 (Ubuntu 4.4.3-4ubuntu5.1)--disable-asm 635 ±1954 / 1954
5 hours agoN-62670-g31f2357sparclinuxgcc 4.4.5 (Debian 4.4.5-8) 844 ±build only
5 hours agoN-62678-g5ac10d4x86_32gnu/kfreebsdgcc 4.3.5 (Debian 4.3.5-4) 571 ±1956 / 1956
5 hours agoN-62670-g31f2357sparclinuxgcc 4.4.5 (Debian 4.4.5-8)--enable-shared 841 ±build only
4 hours agoN-62670-g31f2357x86_32mingw32gcc 4.6 (GCC) 465 ±1952 / 1952
4 hours agoN-62670-g31f2357armv7alinuxgcc 4.4.7 (Ubuntu/Linaro 4.4.7-1ubuntu2) 641 ±1954 / 1954
4 hours agoN-62670-g31f2357x86_32mingw32gcc 4.6 (GCC)--enable-shared 465 ±build only
3 hours agoN-62670-g31f2357x86_32linuxOpen64 Compiler Suite Version 5.0 13435 ±1954 / 1954
3 hours agoN-62678-g5ac10d4x86_64netbsdclang version 3.0 (tags/RELEASE_30/final)--disable-optimizations 617 ±1956 / 1956
2 hours agoN-62670-g31f2357armv4tlinuxgcc 4.4.7 (Ubuntu/Linaro 4.4.7-1ubuntu2) 1922 ±1954 / 1954
2 hours agoN-62670-g31f2357x86_64linuxclang version 3.1 (trunk 144800)Address sanitizer 836 ±1955 / 1955
2 hours agoN-62677-gd66de50x86_32sunosgcc 3.4.3 (GCC) (csl-sol210-3_4-20050802)no yasm 2179 ±1956 / 1956
2 hours agoN-62670-g31f2357armv5telinuxgcc 4.4.5 (Debian 4.4.5-8) 835 ±1951 / 1951
2 hours agoN-62670-g31f2357x86_64linuxPathScale EKOPath(tm) Compiler Suite Version 4.0.12.1 913 ±1954 / 1954
2 hours agoN-62677-gd66de50x86_32win32Microsoft (R) C/C++ Optimizing Compiler Version 17.00.61030 for x86 1771 ±1951 / 1952
1 failed testStatus
filter-metadata-ebur1281
2 hours agoN-62677-gd66de50x86_32sunosgcc 4.3.2 (GCC)no yasm 1456 ±1956 / 1956
119 minutes agoN-62677-gd66de50x86_32linuxgcc 4.4.5 (Ubuntu/Linaro 4.4.4-14ubuntu5)(TB) 634 ±1956 / 1956
113 minutes agoN-62677-gd66de50armv7adarwinApple LLVM version 5.1 (clang-503.0.40) (based on LLVM 3.4svn)(TB) 43 ±error compiling
        ^
/Volumes/share/FFmpeg/libavcodec/arm/mlpdsp_armv5te.S:25106:9: error: unknown directive
        .hword (70f - 0b) / 2, (71f - 0b) / 2, (72f - 0b) / 2, (73f - 0b) / 2, (74f - 0b) / 2
        ^
/Volumes/share/FFmpeg/libavcodec/arm/mlpdsp_armv5te.S:25108:9: error: unknown directive
        .hword (75f - 0b) / 2
        ^
/Volumes/share/FFmpeg/libavcodec/arm/mlpdsp_armv5te.S:25981:9: error: unknown directive
        .hword (70f - 0b) / 2, (71f - 0b) / 2, (72f - 0b) / 2, (73f - 0b) / 2, (74f - 0b) / 2
        ^
/Volumes/share/FFmpeg/libavcodec/arm/mlpdsp_armv5te.S:618:9: error: unknown directive
        .hword 0, 0, (12f - 0b) / 2, (13f - 0b) / 2, (14f - 0b) / 2, (15f - 0b) / 2
        ^
/Volumes/share/FFmpeg/libavcodec/arm/mlpdsp_armv5te.S:619:9: error: unknown directive
        .hword (16f - 0b) / 2, (17f - 0b) / 2, (18f - 0b) / 2, (19f - 0b) / 2
        ^
/Volumes/share/FFmpeg/libavcodec/arm/mlpdsp_armv5te.S:620:9: error: unknown directive
        .hword (20f - 0b) / 2, (21f - 0b) / 2, (22f - 0b) / 2, (23f - 0b) / 2, (24f - 0b) / 2, (25f - 0b) / 2
        ^
make: *** [libavcodec/arm/mlpdsp_armv5te.o] Error 1
103 minutes agoN-62670-g31f2357armv7alinuxgcc 4.5.3 (Ubuntu/Linaro 4.5.3-12ubuntu2) 647 ±1954 / 1954
95 minutes agoN-62677-gd66de50x86_32win32Microsoft (R) C/C++ Optimizing Compiler Version 17.00.61030 for x86--enable-shared 1821 ±1951 / 1952
1 failed testStatus
filter-metadata-ebur1281
87 minutes agoN-62677-gd66de50x86_64linuxgcc 4.7.3 (Gentoo 4.7.3-r1 p1.4, pie-0.5.5)Athlon64 x86_64 CPUFLAGS = mmx + 3dnow + 3dnowext 149 ±1956 / 1956
87 minutes agoN-62677-gd66de50x86_32linuxgcc 4.7.3 (Gentoo 4.7.3-r1 p1.4, pie-0.5.5)Athlon64 x86_32 CPUFLAGS = mmx + 3dnow + 3dnowext 183 ±1956 / 1956
86 minutes agoN-62677-gd66de50x86_32linuxgcc 4.7.3 (Gentoo 4.7.3-r1 p1.4, pie-0.5.5)Athlon64 x86_32 CPUFLAGS = mmx + 3dnow 183 ±1956 / 1956
78 minutes agoN-62670-g31f2357x86_64linuxPathScale EKOPath(tm) Compiler Suite Version 4.0.12.1-O1 734 ±1954 / 1954
75 minutes agoN-62680-g06e6643x86_32mingw32gcc 4.8.1 (GCC)dll, native windows 228 ±1953 / 1953
75 minutes agoN-62670-g31f2357x86_64linuxgcc 4.8.2 (GCC) 20140206 (prerelease)valgrind-3.9.0 full 126 ±1955 / 1955
72 minutes agoN-62677-gd66de50x86_32linuxgcc 4.4.5 (Ubuntu/Linaro 4.4.4-14ubuntu5)(TB) --enable-small 573 ±1956 / 1956
66 minutes agoN-62678-g5ac10d4x86_64freebsdclang version 2.8 (branches/release_28) 537 ±1955 / 1955
49 minutes agoN-62677-gd66de50x86_32sunosSun Ceres C 5.10 SunOS_i386 2009/03/06--disable-yasm --disable-asm --enable-small --disable-podpages 2115 ±1954 / 1954
45 minutes agoN-62682-g26953edx86_64win64Microsoft (R) C/C++ Optimizing Compiler Version 17.00.61030 for x64 2836 ±1951 / 1952
1 failed testStatus
filter-metadata-ebur1281
25 minutes agoN-62670-g31f2357armv4linuxgcc 4.6 (Ubuntu/Linaro 4.6.3-1ubuntu5) 269 ±1954 / 1954
24 minutes agoN-62686-g817627dx86_64mingw32gcc 4.8.1 (GCC)native windows 228 ±1953 / 1953
16 minutes agoN-62678-g5ac10d4x86_64freebsdclang version 2.8 (branches/release_28)--enable-ftrapv 537 ±1954 / 1955
1 failed testStatus
cover-art-wvill
5 minutes agoN-62692-ge148a58x86_32win32Microsoft (R) C/C++ Optimizing Compiler Version 18.00.21005.1 for x86VS2013 1751 ±1952 / 1952