FATE

83.3333333333333%}
13.8095238095238%
2.85714285714286%
TimeRevArchOSCompilerCommentWarningsTests
3 hours agoN-66033-g6abeaf2aarch64darwinApple LLVM version 5.1 (clang-503.0.38) (based on LLVM 3.4svn)--disable-asm
21 hours agoN-66010-g4250753aarch64darwinApple LLVM version 5.1 (clang-503.0.40) (based on LLVM 3.4svn)
6 hours agoN-66032-g7cf1f0faarch64darwinApple LLVM version 5.1 (clang-503.0.40) (based on LLVM 3.4svn)(TB)
2 hours agoN-66031-g1b3a98faarch64linuxgcc 4.8 (Ubuntu/Linaro 4.8.2-13ubuntu1)
1 failed testStatus
h264-conformance-frext-hi422fr10_sony_b1
11 hours agoN-66010-g4250753alphalinuxgcc 4.7 (Debian 4.7.1-3)
2014-08-17n2.3.3alphalinuxgcc 4.7 (Debian 4.7.1-3)
15 hours agoN-66010-g4250753alphalinuxgcc 4.7 (Debian 4.7.1-3)--enable-shared
2014-08-17n2.3.3alphalinuxgcc 4.7 (Debian 4.7.1-3)--enable-shared
16 hours agoN-66005-g3efc174armv4linuxgcc 4.6 (Ubuntu/Linaro 4.6.3-1ubuntu5)
3 hours agoN-66031-g1b3a98farmv4tlinuxgcc 4.4.7 (Ubuntu/Linaro 4.4.7-1ubuntu2)
19 hours agoN-66005-g3efc174armv4tlinuxgcc 4.4.7 (Ubuntu/Linaro 4.4.7-1ubuntu2)
14 hours agoN-66005-g3efc174armv5linuxgcc 4.6 (Ubuntu/Linaro 4.6.3-1ubuntu5)
42 minutes agoN-66033-g6abeaf2armv5tlinuxgcc 4.1.3 (GCC) 20080704 (prerelease) (Ubuntu 4.1.2-27ubuntu1)
1 failed testStatus
yuvj444p1
2 hours agoN-66031-g1b3a98farmv5tlinuxgcc 4.4.7 (Ubuntu/Linaro 4.4.7-1ubuntu2)
34 minutes agoN-66010-g4250753armv5telinuxgcc 4.4.5 (Debian 4.4.5-8)
2014-08-18n2.3.3armv5telinuxgcc 4.4.5 (Debian 4.4.5-8)
7 failed testsStatus
vc1-ismILL
vc1_sa00040ILL
vc1_sa00050ILL
vc1_sa10091ILL
vc1_sa10143ILL
vc1_sa20021ILL
wmapro-ismILL
87 minutes agoN-66031-g1b3a98farmv5telinuxgcc 4.4.7 (Ubuntu/Linaro 4.4.7-1ubuntu2)
26 minutes agoN-66031-g1b3a98farmv6linuxgcc 4.4.7 (Ubuntu/Linaro 4.4.7-1ubuntu2)
3 hours agoN-66033-g6abeaf2armv6jdarwinApple LLVM version 5.1 (clang-503.0.38) (based on LLVM 3.4svn)--disable-asm
26 hours agoN-66005-g3efc174armv6jlinuxgcc 4.4.7 (Ubuntu/Linaro 4.4.7-1ubuntu2)
12 hours agoN-66005-g3efc174armv6t2linuxgcc 4.6 (Ubuntu/Linaro 4.6.3-1ubuntu5)
25 hours agoN-66005-g3efc174armv6zlinuxgcc 4.4.7 (Ubuntu/Linaro 4.4.7-1ubuntu2)
23 hours agoN-66005-g3efc174armv6zklinuxgcc 4.4.7 (Ubuntu/Linaro 4.4.7-1ubuntu2)
11 hours agoN-66005-g3efc174armv7linuxgcc 4.6 (Ubuntu/Linaro 4.6.3-1ubuntu5)
3 hours agoN-66033-g6abeaf2armv7adarwinApple LLVM version 5.1 (clang-503.0.38) (based on LLVM 3.4svn)--disable-asm
21 hours agoN-66010-g4250753armv7adarwinApple LLVM version 5.1 (clang-503.0.40) (based on LLVM 3.4svn)
5 hours agoN-66032-g7cf1f0farmv7adarwinApple LLVM version 5.1 (clang-503.0.40) (based on LLVM 3.4svn)(TB)
CC	libavdevice/alldevices.o
CC	libavdevice/avdevice.o
CC	libavdevice/avfoundation.o
/Volumes/share/FFmpeg/libavdevice/avfoundation.m:73:5: warning: '__MAC_OS_X_VERSION_MIN_REQUIRED' is not defined, evaluates to 0 [-Wundef]
#if __MAC_OS_X_VERSION_MIN_REQUIRED >= 1080
    ^
1 warning generated.
CC	libavdevice/lavfi.o
AR	libavdevice/libavdevice.a
fatal error: /Applications/Xcode.app/Contents/Developer/Toolchains/XcodeDefault.xctoolchain/usr/bin/ar: fatal error in /Applications/Xcode.app/Contents/Developer/Toolchains/XcodeDefault.xctoolchain/usr/bin/ranlib
make: *** [libavdevice/libavdevice.a] Error 1
15 hours agoN-66010-g4250753armv7alinuxgcc 4.4.3 (GCC)Android NDKr8
2014-08-17n2.3.3armv7alinuxgcc 4.4.3 (GCC)Android NDKr8
14 hours agoN-66010-g4250753armv7alinuxgcc 4.4.3 (GCC)Android NDKr8 --enable-shared
2014-08-17n2.3.3armv7alinuxgcc 4.4.3 (GCC)Android NDKr8 --enable-shared
8 hours agoN-66016-g8d6ec61armv7alinuxgcc 4.4.3 (Ubuntu 4.4.3-4ubuntu5.1)
6 hours agoN-66016-g8d6ec61armv7alinuxgcc 4.4.3 (Ubuntu 4.4.3-4ubuntu5.1)
3 hours agoN-66016-g8d6ec61armv7alinuxgcc 4.4.3 (Ubuntu 4.4.3-4ubuntu5.1)--disable-asm
21 hours agoN-66005-g3efc174armv7alinuxgcc 4.4.7 (Ubuntu/Linaro 4.4.7-1ubuntu2)
17 hours agoN-66005-g3efc174armv7alinuxgcc 4.5.3 (Ubuntu/Linaro 4.5.3-12ubuntu2)
9 hours agoN-66005-g3efc174armv7alinuxgcc 4.6 (Ubuntu/Linaro 4.6.3-1ubuntu5)
1 failed testStatus
siff-demux1
8 hours agoN-66005-g3efc174armv7alinuxgcc 4.6 (Ubuntu/Linaro 4.6.3-1ubuntu5)--enable-neon-clobber-test
6 hours agoN-66005-g3efc174armv7alinuxgcc 4.6 (Ubuntu/Linaro 4.6.3-1ubuntu5)--enable-pic
4 hours agoN-66005-g3efc174armv7alinuxgcc 4.6 (Ubuntu/Linaro 4.6.3-1ubuntu5)--enable-thumb
5 hours agoN-66005-g3efc174armv7alinuxgcc 4.6 (Ubuntu/Linaro 4.6.3-1ubuntu5)2 threads
12 hours agoN-66010-g4250753ia64linuxgcc 4.4.5 (Debian 4.4.5-8)
2014-08-17n2.3.3ia64linuxgcc 4.4.5 (Debian 4.4.5-8)
12 hours agoN-66010-g4250753ia64linuxgcc 4.4.5 (Debian 4.4.5-8)--enable-shared --enable-small
2014-08-17n2.3.3ia64linuxgcc 4.4.5 (Debian 4.4.5-8)--enable-shared --enable-small
11 hours agoN-66010-g4250753mipslinuxgcc 4.4.3 (GCC)Android NDKr8
2014-08-17n2.3.3mipslinuxgcc 4.4.3 (GCC)Android NDKr8
10 hours agoN-66010-g4250753mipslinuxgcc 4.4.3 (GCC)Android NDKr8 --enable-shared
2014-08-17n2.3.3mipslinuxgcc 4.4.3 (GCC)Android NDKr8 --enable-shared
21 hours agoN-65992-ge023720mipslinuxgcc 4.4.5 (Debian 4.4.5-8)--disable-mipsfpu --disable-pthreads
2014-08-18n2.3.3mipslinuxgcc 4.4.5 (Debian 4.4.5-8)--disable-mipsfpu --disable-pthreads
14 hours agoN-66010-g4250753parisclinuxgcc 4.2.4 (GCC) (Debian 4.2.4-6)
2014-08-17n2.3.3parisclinuxgcc 4.2.4 (GCC) (Debian 4.2.4-6)
14 hours agoN-66010-g4250753parisclinuxgcc 4.2.4 (GCC) (Debian 4.2.4-6)--enable-shared
2014-08-17n2.3.3parisclinuxgcc 4.2.4 (GCC) (Debian 4.2.4-6)--enable-shared
10 hours agoN-66010-g4250753ppclinuxgcc 4.3.5 (Debian 4.3.5-4)
2014-08-17n2.3.3ppclinuxgcc 4.3.5 (Debian 4.3.5-4)
44 hours agoN-66033-g6abeaf2ppclinuxgcc 4.3.5 (Ubuntu 4.3.5-3ubuntu1)(TB)
43 hours agoN-66033-g6abeaf2ppclinuxgcc 4.4.5 (Ubuntu/Linaro 4.4.4-14ubuntu5)(TB)
47 hours agoN-66032-g7cf1f0fppclinuxgcc 4.5.1 (Ubuntu/Linaro 4.5.1-7ubuntu2)(TB)
117 minutes agoN-66031-g1b3a98fppc64linuxgcc 4.8 (Ubuntu 4.8.2-16ubuntu4)
4 hours agoN-66032-g7cf1f0fppc64linuxgcc 4.8.2 (GCC) 20140120 (Red Hat 4.8.2-16)ibmcrl-power8be
78 minutes agoN-66033-g6abeaf2ppc64linuxgcc 4.9.0 (GCC)ibmcrl-power7be
9 hours agoN-66010-g4250753s390linuxgcc 4.4.5 (Debian 4.4.5-8)
2014-08-17n2.3.3s390linuxgcc 4.4.5 (Debian 4.4.5-8)
8 hours agoN-66010-g4250753s390linuxgcc 4.4.5 (Debian 4.4.5-8)--enable-shared
2014-08-17n2.3.3s390linuxgcc 4.4.5 (Debian 4.4.5-8)--enable-shared
15 hours agoN-65992-ge023720sh4linuxgcc 4.7 (Debian 4.7.1-3)
13 days agon2.3.3sh4linuxgcc 4.7 (Debian 4.7.1-3)
7 hours agoN-66010-g4250753sh4linuxgcc 4.7 (Debian 4.7.1-3)--enable-shared
2014-08-18n2.3.3sh4linuxgcc 4.7 (Debian 4.7.1-3)--enable-shared
7 hours agoN-66010-g4250753sparclinuxgcc 4.4.5 (Debian 4.4.5-8)
2014-08-18n2.3.3sparclinuxgcc 4.4.5 (Debian 4.4.5-8)
6 hours agoN-66010-g4250753sparclinuxgcc 4.4.5 (Debian 4.4.5-8)--enable-shared
2014-08-18n2.3.3sparclinuxgcc 4.4.5 (Debian 4.4.5-8)--enable-shared
44 hours agoN-66001-g6d7aa43x86_32cygwingcc 4.8.2 (GCC)
2 hours agoN-66033-g6abeaf2x86_32darwinclang version 3.4.2 (tags/RELEASE_34/dot2-final)
106 minutes agoN-66033-g6abeaf2x86_32darwinclang version 3.5.0 (trunk 210448)
1 failed testStatus
lagarith-yv121
65 minutes agoN-66033-g6abeaf2x86_32darwinclang version 3.5.0 (trunk 210448)-O3
1 failed testStatus
lagarith-yv121
22 minutes agoN-66035-g4cabee5x86_32darwinclang version 3.5.0 (trunk 210448)-polly
11 failed testsStatus
acodec-g723_11
amrnb-10k21
amrnb-4k751
amrnb-5k151
amrnb-5k91
amrnb-6k71
amrnb-7k41
amrnb-7k951
filter-metadata-ebur1281
lagarith-yv121
sipr-16k1
13 hours agoN-66016-g8d6ec61x86_32darwinclang version 3.5.0 (trunk 210448)-polly -polly-vectorizer=polly
12 failed testsStatus
acodec-g723_11
amrnb-10k21
amrnb-4k751
amrnb-5k151
amrnb-5k91
amrnb-6k71
amrnb-7k41
amrnb-7k951
filter-metadata-ebur1281
filter-separatefields1
lagarith-yv121
sipr-16k1
12 hours agoN-66016-g8d6ec61x86_32darwingcc 4.6.4 (MacPorts gcc46 4.6.4_5+universal)--disable-yasm
11 hours agoN-66019-ge8d0b84x86_32darwingcc 4.7.3 (MacPorts gcc47 4.7.3_5+universal)
11 hours agoN-66023-g052cd1cx86_32darwingcc 4.8.2 (MacPorts gcc48 4.8.2_2+universal)
10 hours agoN-66027-gf626eaax86_32darwingcc 4.9.0 (MacPorts gcc49 4.9-20140416_2+universal) 20140416 (prerelease)
13 failed testsStatus
acodec-flac1
filter-metadata-ebur1281
flac-16-chmode-indep1
flac-16-chmode-left_side1
flac-16-chmode-mid_side1
flac-16-chmode-right_side1
flac-16-fixed1
flac-16-lpc-cholesky1
flac-16-lpc-levinson1
flac-24-comp-81
loco-rgb1
loco-yuy21
lossless-shorten1
4 hours agoN-66031-g1b3a98fx86_32gnu/kfreebsdgcc 4.1.3 (GCC) 20080704 (prerelease) (Debian 4.1.2-29)
3 hours agoN-66031-g1b3a98fx86_32gnu/kfreebsdgcc 4.3.5 (Debian 4.3.5-4)
3 hours agoN-66031-g1b3a98fx86_32gnu/kfreebsdgcc 4.4.5 (Debian 4.4.5-8)
2 hours agoN-66031-g1b3a98fx86_32gnu/kfreebsdgcc 4.4.5 (Debian 4.4.5-8)cpuflags=0
58 minutes agoN-66031-g1b3a98fx86_32gnu/kfreebsdgcc 4.4.5 (Debian 4.4.5-8)cpuflags=MMX
10 hours agoN-66016-g8d6ec61x86_32gnu/kfreebsdgcc 4.4.5 (Debian 4.4.5-8)cpuflags=MMX + MMX2
9 hours agoN-66016-g8d6ec61x86_32gnu/kfreebsdgcc 4.4.5 (Debian 4.4.5-8)cpuflags=MMX + MMX2 + SSE
8 hours agoN-66016-g8d6ec61x86_32gnu/kfreebsdgcc 4.4.5 (Debian 4.4.5-8)cpuflags=MMX + MMX2 + SSE + SSE2
7 hours agoN-66016-g8d6ec61x86_32gnu/kfreebsdgcc 4.4.5 (Debian 4.4.5-8)cpuflags=MMX + MMX2 + SSE + SSE2 + SSE3
5 hours agoN-66016-g8d6ec61x86_32gnu/kfreebsdgcc 4.4.5 (Debian 4.4.5-8)cpuflags=MMX + MMX2 + SSE + SSE2 + SSE3 + SSSE3
6 hours agoN-66016-g8d6ec61x86_32gnu/kfreebsdgcc 4.4.5 (Debian 4.4.5-8)cpuflags=MMX + MMX2 + SSE + SSE2 + SSE3 + SSSE3 + SSE4.1
6 hours agoN-66016-g8d6ec61x86_32gnu/kfreebsdgcc 4.4.5 (Debian 4.4.5-8)cpuflags=MMX + MMX2 + SSE + SSE2 + SSE3 + SSSE3 + SSE4.1 + SSE4.2
6 days agon2.3.3x86_32haikugcc 4.3.3 (GCC)
2014-08-11n2.3.2x86_32haikugcc 4.3.3 (GCC)
3 days agoN-65915-g570397cx86_32linuxgcc 4.4.5 (Ubuntu/Linaro 4.4.4-14ubuntu5)(TB)
1 failed testStatus
vp8-alpha1
5 days agoN-65916-g9e8ab36x86_32linuxgcc 4.4.5 (Ubuntu/Linaro 4.4.4-14ubuntu5)(TB) --enable-small
CC	libavcodec/xiph.o
CC	libavcodec/xl.o
CC	libavcodec/xsubdec.o
CC	libavcodec/xsubenc.o
CC	libavcodec/xvid_c_idct.o
CC	libavcodec/xvididct.o
CC	libavcodec/xwddec.o
CC	libavcodec/xwdenc.o
CC	libavcodec/xxan.o
CC	libavcodec/y41pdec.o
CC	libavcodec/y41penc.o
CC	libavcodec/yop.o
CC	libavcodec/yuv4dec.o
CC	libavcodec/yuv4enc.o
CC	libavcodec/zerocodec.o
CC	libavcodec/zmbv.o
CC	libavcodec/zmbvenc.o
AR	libavcodec/libavcodec.a
ar: libavcodec/x86/idct_mmx_xvid.o: No such file or directory
make: *** [libavcodec/libavcodec.a] Error 1
3 days agoN-65915-g570397cx86_32linuxgcc 4.5.1 (Ubuntu/Linaro 4.5.1-7ubuntu2)(TB)
1 failed testStatus
vp8-alpha1
5 days agoN-65905-g46ad2c4x86_32linuxgcc 4.5.1 (Ubuntu/Linaro 4.5.1-7ubuntu2)(TB) !HAVE_6REGS
1 failed testStatus
hevc-conformance-SAO_A_RExt_MediaTek_1KILL
2 hours agoN-66033-g6abeaf2x86_32linuxgcc 4.7.3 (Gentoo 4.7.3-r1 p1.4, pie-0.5.5)Athlon64 x86_32 CPUFLAGS = mmx + 3dnow
2 hours agoN-66033-g6abeaf2x86_32linuxgcc 4.7.3 (Gentoo 4.7.3-r1 p1.4, pie-0.5.5)Athlon64 x86_32 CPUFLAGS = mmx + 3dnow + 3dnowext
3 days agoN-65924-g12df9b9x86_32linuxicc (ICC) 12.0.4 20110427(TB) --disable-decoder=hevc
CC	libavcodec/xiph.o
CC	libavcodec/xl.o
CC	libavcodec/xsubdec.o
CC	libavcodec/xsubenc.o
CC	libavcodec/xvid_c_idct.o
CC	libavcodec/xvididct.o
CC	libavcodec/xwddec.o
CC	libavcodec/xwdenc.o
CC	libavcodec/xxan.o
CC	libavcodec/y41pdec.o
CC	libavcodec/y41penc.o
CC	libavcodec/yop.o
CC	libavcodec/yuv4dec.o
CC	libavcodec/yuv4enc.o
CC	libavcodec/zerocodec.o
CC	libavcodec/zmbv.o
CC	libavcodec/zmbvenc.o
AR	libavcodec/libavcodec.a
ar: libavcodec/x86/idct_mmx_xvid.o: No such file or directory
make: *** [libavcodec/libavcodec.a] Error 1
109 minutes agoN-66010-g4250753x86_32linuxOpen64 Compiler Suite Version 5.0
2014-08-18n2.3.3x86_32linuxOpen64 Compiler Suite Version 5.0
4 hours agoN-66010-g4250753x86_32mingw32gcc 4.6 (GCC)
2014-08-18n2.3.3x86_32mingw32gcc 4.6 (GCC)
4 hours agoN-66010-g4250753x86_32mingw32gcc 4.6 (GCC)--enable-shared
2014-08-18n2.3.3x86_32mingw32gcc 4.6 (GCC)--enable-shared
2 hours agoN-66033-g6abeaf2x86_32mingw32gcc 4.9.1 (GCC)dll, native windows
8 days agoN-65872-g5113980x86_32os/2gcc 4.4.6 (GCC)nasm 2.11.04
2014-08-09N-65448-g3e41d2ex86_32sunosgcc 3.4.3 (GCC) (csl-sol210-3_4-20050802)no yasm
2014-08-10N-65448-g3e41d2ex86_32sunosgcc 4.3.2 (GCC)no yasm
2014-08-10N-65448-g3e41d2ex86_32sunosSun Ceres C 5.10 SunOS_i386 2009/03/06--disable-yasm --disable-asm --enable-small --disable-podpages
13 hours agoN-66016-g8d6ec61x86_32win32Intel(R) C++ Compiler XE for applications running on IA-32, Version 14.0.2.176 Build 20140130ICL 2013 Shared (32-bit)
11 days agoN-65800-gf6ff1cbx86_32win32Microsoft (R) C/C++ Optimizing Compiler Version 17.00.61030 for x86VS2012
1 failed testStatus
filter-metadata-ebur1281
97 minutes agoN-66033-g6abeaf2x86_32win32Microsoft (R) C/C++ Optimizing Compiler Version 18.00.30723 for x86VS2013
77 minutes agoN-66033-g6abeaf2x86_32win32Microsoft (R) C/C++ Optimizing Compiler Version 18.00.30723 for x86VS2013 --enable-shared
18 hours agoN-66015-g343f07ex86_64cygwingcc 4.8.3 (GCC)
14 failed testsStatus
lavf-sunrast1
lavf-swf1
7 hours agoN-66032-g7cf1f0fx86_64darwinApple LLVM version 5.1 (clang-503.0.38) (based on LLVM 3.4svn)
20 hours agoN-66010-g4250753x86_64darwinApple LLVM version 5.1 (clang-503.0.40) (based on LLVM 3.4svn)
9 hours agoN-66031-g1b3a98fx86_64darwinclang version 3.3 (tags/RELEASE_33/final)
9 hours agoN-66031-g1b3a98fx86_64darwinclang version 3.4.2 (tags/RELEASE_34/dot2-final)
8 hours agoN-66031-g1b3a98fx86_64darwinclang version 3.5.0 (trunk 210448)
7 hours agoN-66032-g7cf1f0fx86_64darwinclang version 3.5.0 (trunk 210448)-O3
6 hours agoN-66032-g7cf1f0fx86_64darwinclang version 3.5.0 (trunk 210448)-polly -polly-vectorizer=polly
2 failed testsStatus
acodec-g723_11
filter-separatefields1
6 hours agoN-66032-g7cf1f0fx86_64darwingcc 4.6.4 (MacPorts gcc46 4.6.4_5+universal)--disable-yasm
5 hours agoN-66032-g7cf1f0fx86_64darwingcc 4.7.3 (MacPorts gcc47 4.7.3_5+universal)
4 hours agoN-66032-g7cf1f0fx86_64darwingcc 4.8.2 (MacPorts gcc48 4.8.2_2+universal)
3 hours agoN-66032-g7cf1f0fx86_64darwingcc 4.9.0 (MacPorts gcc49 4.9-20140416_2+universal) 20140416 (prerelease)
13 failed testsStatus
acodec-flac1
filter-metadata-ebur1281
flac-16-chmode-indep1
flac-16-chmode-left_side1
flac-16-chmode-mid_side1
flac-16-chmode-right_side1
flac-16-fixed1
flac-16-lpc-cholesky1
flac-16-lpc-levinson1
flac-24-comp-81
loco-rgb1
loco-yuy21
lossless-shorten1
23 minutes agoN-66033-g6abeaf2x86_64freebsdclang version 2.8 (branches/release_28)
6 hours agoN-66031-g1b3a98fx86_64freebsdclang version 2.8 (branches/release_28)--enable-ftrapv
1 failed testStatus
cover-art-wvill
5 hours agoN-66031-g1b3a98fx86_64freebsdgcc 3.4.6 (GCC) [FreeBSD]--disable-asm
5 hours agoN-66031-g1b3a98fx86_64freebsdgcc 4.2.5 (GCC) 20090325 (prerelease)--disable-asm
4 hours agoN-66031-g1b3a98fx86_64freebsdgcc 4.4.6 (GCC) 20110201 (prerelease)
3 hours agoN-66031-g1b3a98fx86_64freebsdgcc 4.6.0 (GCC) 20110205 (experimental)
2 hours agoN-66031-g1b3a98fx86_64freebsdgcc 4.6.0 (GCC) 20110205 (experimental)--disable-optimizations
80 minutes agoN-66031-g1b3a98fx86_64freebsdllvm-gcc 4.2.1 (LLVM build)
21 hours agoN-66002-g63a52cax86_64linuxclang version 3.1 (trunk 144800)Address sanitizer
2014-08-18n2.3.3x86_64linuxclang version 3.1 (trunk 144800)Address sanitizer
2 days agoN-65971-g4c92047x86_64linuxgcc 4.4.5 (Ubuntu/Linaro 4.4.4-14ubuntu5)(TB)
AR	libavformat/libavformat.a
CC	libavcodec/aaccoder.o
/home/fate/x86_64-linux-gnu-gcc-4.4.5/src/libavcodec/aaccoder.c: In function ‘search_for_quantizers_faac’:
/home/fate/x86_64-linux-gnu-gcc-4.4.5/src/libavcodec/aaccoder.c:960: warning: ‘b’ may be used uninitialized in this function
CC	libavcodec/aic.o
CC	libavcodec/atrac3plus.o
CC	libavcodec/dcaenc.o
CC	libavcodec/evrcdec.o
CC	libavcodec/g722dec.o
CC	libavcodec/snow.o
CC	libavcodec/snowdec.o
CC	libavcodec/snowenc.o
/home/fate/x86_64-linux-gnu-gcc-4.4.5/src/libavcodec/snowenc.c: In function ‘encode_frame’:
/home/fate/x86_64-linux-gnu-gcc-4.4.5/src/libavcodec/snowenc.c:1551: warning: initialization discards qualifiers from pointer target type
/home/fate/x86_64-linux-gnu-gcc-4.4.5/src/libavcodec/snowenc.c:1578: warning: assignment discards qualifiers from pointer target type
AR	libavcodec/libavcodec.a
CC	cmdutils.o
LD	ffmpeg_g
collect2: ld terminated with signal 9 [Killed]
make: *** [ffmpeg_g] Error 1
4 days agoN-65915-g570397cx86_64linuxgcc 4.4.5 (Ubuntu/Linaro 4.4.4-14ubuntu5)(TB) --enable-small
38 hours agoN-65971-g4c92047x86_64linuxgcc 4.5.1 (Ubuntu/Linaro 4.5.1-7ubuntu2)(TB)
CC	libavformat/rtsp.o
CC	libavformat/rtspdec.o
CC	libavformat/rtspenc.o
CC	libavformat/udp.o
AR	libavformat/libavformat.a
CC	libavcodec/fft_fixed.o
CC	libavcodec/fft_fixed_32.o
CC	libavcodec/fft_float.o
CC	libavcodec/fft_init_table.o
CC	libavcodec/h264.o
CC	libavcodec/proresenc_kostya.o
/home/fate/x86_64-linux-gnu-gcc-4.5.1/src/libavcodec/proresenc_kostya.c: In function ‘find_quant_thread’:
/home/fate/x86_64-linux-gnu-gcc-4.5.1/src/libavcodec/proresenc_kostya.c:762:16: warning: ‘bits’ may be used uninitialized in this function
CC	libavcodec/vp3.o
AR	libavcodec/libavcodec.a
CC	cmdutils.o
CC	ffmpeg_filter.o
LD	ffmpeg_g
collect2: ld terminated with signal 9 [Killed]
make: *** [ffmpeg_g] Error 1
104 minutes agoN-66033-g6abeaf2x86_64linuxgcc 4.7.3 (Gentoo 4.7.3-r1 p1.4, pie-0.5.5)Athlon64 x86_64 CPUFLAGS = mmx + 3dnow + 3dnowext
61 minutes agoN-66035-g4cabee5x86_64linuxgcc 4.9.1 (GCC)--disable-avcodec
57 minutes agoN-66035-g4cabee5x86_64linuxgcc 4.9.1 (GCC)--disable-avdevice
55 minutes agoN-66035-g4cabee5x86_64linuxgcc 4.9.1 (GCC)--disable-avfilter
53 minutes agoN-66035-g4cabee5x86_64linuxgcc 4.9.1 (GCC)--disable-avformat
52 minutes agoN-66035-g4cabee5x86_64linuxgcc 4.9.1 (GCC)--disable-everything
10 hours agoN-66031-g1b3a98fx86_64linuxgcc 4.9.1 (GCC)--disable-gpl
50 minutes agoN-66035-g4cabee5x86_64linuxgcc 4.9.1 (GCC)--disable-mmx
49 minutes agoN-66035-g4cabee5x86_64linuxgcc 4.9.1 (GCC)--disable-optimizations
47 minutes agoN-66035-g4cabee5x86_64linuxgcc 4.9.1 (GCC)--disable-swresample
44 minutes agoN-66035-g4cabee5x86_64linuxgcc 4.9.1 (GCC)--disable-swscale
40 minutes agoN-66035-g4cabee5x86_64linuxgcc 4.9.1 (GCC)--disable-zlib
10 hours agoN-66031-g1b3a98fx86_64linuxgcc 4.9.1 (GCC)--enable-random
36 minutes agoN-66035-g4cabee5x86_64linuxgcc 4.9.1 (GCC)--enable-shared + libs
62 minutes agoN-66034-ge6b125ex86_64linuxgcc 4.9.1 (GCC)-DDEBUG -DTRACE
75 minutes agoN-66033-g6abeaf2x86_64linuxgcc 4.9.1 (GCC)checkheaders
9 hours agoN-66031-g1b3a98fx86_64linuxgcc 4.9.1 (GCC)disable runtime cpu detect
33 minutes agoN-66035-g4cabee5x86_64linuxgcc 4.9.1 (GCC)Examples
24 minutes agoN-66035-g4cabee5x86_64linuxgcc 4.9.1 (GCC)GCC AddressSanitizer (asan)
10 hours agoN-66027-gf626eaax86_64linuxgcc 4.9.1 (GCC)GCC ThreadSanitizer (tsan)
10 hours agoN-66031-g1b3a98fx86_64linuxgcc 4.9.1 (GCC)GCC UndefinedBehaviorSanitizer (ubsan)
107 minutes agoN-66032-g7cf1f0fx86_64linuxgcc 4.9.1 (GCC)Helgrind (threads=2)
10 hours agoN-66031-g1b3a98fx86_64linuxgcc 4.9.1 (GCC)LTO (shared)
10 hours agoN-66031-g1b3a98fx86_64linuxgcc 4.9.1 (GCC)NASM version 2.11.05
9 hours agoN-66031-g1b3a98fx86_64linuxgcc 4.9.1 (GCC)threads auto
1 failed testStatus
hevc-conformance-BUMPING_A_ericsson_11
9 hours agoN-66031-g1b3a98fx86_64linuxgcc 4.9.1 (GCC)THREADS=7 THREAD_TYPE=slice
8 hours agoN-66031-g1b3a98fx86_64linuxgcc 4.9.1 (GCC)Valgrind DRD (threads=2)
6 hours agoN-66032-g7cf1f0fx86_64linuxgcc 4.9.1 (GCC)valgrind-3.9.0 full
5 hours agoN-66032-g7cf1f0fx86_64linuxgcc 4.9.1 (GCC)valgrind-3.9.0 no-undef
10 hours agoN-66031-g1b3a98fx86_64linuxgcc 4.9.1 (GCC)yasm-0.8.0
9 hours agoN-66031-g1b3a98fx86_64linuxgcc 4.9.1 (GCC)2 threads
9 hours agoN-66031-g1b3a98fx86_64linuxgcc 4.9.1 (GCC)8 threads
9 hours agoN-66031-g1b3a98fx86_64linuxgcc 4.9.1 (GCC)16 threads
3 days agoN-65902-gcf0e8e7x86_64linuxicc (ICC) 12.0.4 20110427(TB)
2 failed testsStatus
hevc-conformance-SAO_A_RExt_MediaTek_1KILL
vp8-alpha1
5 days agoN-65891-gf75baa6x86_64linuxicc (ICC) 12.1.6 20120928(TB)
10 hours agoN-66031-g1b3a98fx86_64linuxicc (ICC) 13.1.1 20130313
7 hours agoN-65941-ge651694x86_64linuxicc (ICC) 13.1.3 20130607(TB)
MAN	doc/libswresample.3
MAN	doc/libavcodec.3
MAN	doc/libavformat.3
MAN	doc/libavdevice.3
MAN	doc/libavfilter.3
CC	ffmpeg.o
/home/fate/x86_64-linux-gnu-icc-2013.5.192/src/ffmpeg.c(621): warning #1478: field "destruct" (declared at line 1173 of "/home/fate/x86_64-linux-gnu-icc-2013.5.192/src/libavcodec/avcodec.h") was declared deprecated
          if(a == 0 && new_pkt.data != pkt->data && new_pkt.destruct) {
                                                            ^

/home/fate/x86_64-linux-gnu-icc-2013.5.192/src/ffmpeg.c(1898): warning #1478: function "av_log_ask_for_sample" (declared at line 5091 of "/home/fate/x86_64-linux-gnu-icc-2013.5.192/src/libavcodec/avcodec.h") was declared deprecated
              av_log_ask_for_sample(
              ^

CC	cmdutils.o
CC	ffmpeg_opt.o
CC	ffmpeg_filter.o
LD	ffmpeg_g
icc: error #10106: Fatal error in ld, terminated by kill signal
make: *** [ffmpeg_g] Error 1
6 days agoN-65879-gf1b04f8x86_64linuxicc (ICC) 14.0.2 20140120(TB)
15 hours agoN-66002-g63a52cax86_64linuxOpen64 Compiler Suite Version 5.0
13 days agon2.3.3x86_64linuxOpen64 Compiler Suite Version 5.0
19 hours agoN-66002-g63a52cax86_64linuxPathScale EKOPath(tm) Compiler Suite Version 4.0.12.1
2014-08-18n2.3.3x86_64linuxPathScale EKOPath(tm) Compiler Suite Version 4.0.12.1
18 hours agoN-66002-g63a52cax86_64linuxPathScale EKOPath(tm) Compiler Suite Version 4.0.12.1-O1
2014-08-18n2.3.3x86_64linuxPathScale EKOPath(tm) Compiler Suite Version 4.0.12.1-O1
16 hours agoN-66002-g63a52cax86_64mingw32gcc 4.6 (GCC)
2014-08-18n2.3.3x86_64mingw32gcc 4.6 (GCC)
16 hours agoN-66002-g63a52cax86_64mingw32gcc 4.6 (GCC)--enable-shared
2014-08-18n2.3.3x86_64mingw32gcc 4.6 (GCC)--enable-shared
16 hours agoN-66002-g63a52cax86_64mingw32gcc 4.6 (GCC)--enable-xmm-clobber-test
2014-08-19n2.3.3x86_64mingw32gcc 4.6 (GCC)--enable-xmm-clobber-test
117 minutes agoN-66033-g6abeaf2x86_64mingw32gcc 4.9.1 (GCC)native windows
43 hours agoN-66031-g1b3a98fx86_64netbsdclang version 3.0 (tags/RELEASE_30/final)--disable-optimizations
41 hours agoN-66031-g1b3a98fx86_64netbsdgcc 3.3.6 (GCC)
40 hours agoN-66031-g1b3a98fx86_64netbsdgcc 3.4.6 (GCC)
42 hours agoN-66031-g1b3a98fx86_64netbsdgcc 4.1.3 (GCC) 20080704 prerelease (NetBSD nb2 20081120)
39 hours agoN-66031-g1b3a98fx86_64netbsdgcc 4.4.7 (GCC)
38 hours agoN-66031-g1b3a98fx86_64netbsdgcc 4.5.3 (GCC)
44 hours agoN-66016-g8d6ec61x86_64netbsdgcc 4.6.3 (GCC)
26 hours agoN-66033-g6abeaf2x86_64openbsdgcc 3.3.6 (GCC)
31 hours agoN-66031-g1b3a98fx86_64openbsdgcc 4.2.1 (GCC) 20070719
29 hours agoN-66031-g1b3a98fx86_64openbsdgcc 4.2.1 (GCC) 20070719--enable-ftrapv
30 hours agoN-66031-g1b3a98fx86_64openbsdgcc 4.2.1 (GCC) 20070719hardcoded tables without asm
13 hours agoN-66016-g8d6ec61x86_64win64Intel(R) C++ Intel(R) 64 Compiler XE for applications running on Intel(R) 64, Version 14.0.2.176 Build 20140130ICL 2013 Shared
59 minutes agoN-66033-g6abeaf2x86_64win64Microsoft (R) C/C++ Optimizing Compiler Version 18.00.30723 for x64VS2013